Reaction Details
TargetIsoform 4 of Lethal(3)malignant brain tumor-like protein 1 (4)
LigandBDBM50341833
Substrate/Competitorn/a
Meas. Tech.ChEMBL_743614 (CHEMBL1768157)
Kd 7.8E4±n/a nM
Citation Herold, JMWigle, TJNorris, JLLam, RKorboukh, VKGao, CIngerman, LAKireev, DBSenisterra, GVedadi, MTripathy, ABrown, PJArrowsmith, CHJin, JJanzen, WPFrye, SV Small-molecule ligands of methyl-lysine binding proteins. J Med Chem54:2504-11 (2011) 
 
Isoform 4 of Lethal(3)malignant brain tumor-like protein 1 (4)
Name:Isoform 4 of Lethal(3)malignant brain tumor-like protein 1 (4)
Type:Protein
Mol. Mass.:83871.06
Organism:Homo sapiens (Human)
Description:Q9Y468-4
Residue:752
BDBM50341833
NameBDBM50341833
Synonyms:(S)-2-amino-N-((S)-1-(5-(ethyl(methyl)amino)pentylamino)-1-oxo-3-phenylpropan-2-yl)-3-(1H-imidazol-4-yl)propanamide | CHEMBL1767020
TypeSmall organic molecule
Emp. Form.C23H36N6O2
Mol. Mass.428.5709
SMILESCCN(C)CCCCCNC(=O)[C@H](Cc1ccccc1)NC(=O)[C@@H](N)Cc1cnc[nH]1