Reaction Details
TargetHistone deacetylase 1
LigandBDBM50341839
Substrate/Competitorn/a
Meas. Tech.ChEMBL_743698 (CHEMBL1767467)
IC50 8120±n/a nM
Citation Botta, CBCabri, WCini, EDe Cesare, LFattorusso, CGiannini, GPersico, MPetrella, ARondinelli, FRodriquez, MRusso, ATaddei, M Oxime amides as a novel zinc binding group in histone deacetylase inhibitors: synthesis, biological activity, and computational evaluation. J Med Chem54:2165-82 (2011) 
 
Histone deacetylase 1
Name:Histone deacetylase 1
Type:Enzyme
Mol. Mass.:55090.27
Organism:Homo sapiens (Human)
Description:Q13547
Residue:482
BDBM50341839
NameBDBM50341839
Synonyms:5-(3-Aminophenyl)-N-(7-(hydroxyimino)-8-(methylamino)-8-oxooctyl)isoxazole-3-carboxamide | CHEMBL1767043
TypeSmall organic molecule
Emp. Form.C19H25N5O4
Mol. Mass.387.4329
SMILESCNC(=O)C(CCCCCCNC(=O)c1cc(on1)-c1cccc(N)c1)N=O