Reaction Details
TargetHistone deacetylase 6
LigandBDBM50341842
Substrate/Competitorn/a
Meas. Tech.ChEMBL_743702 (CHEMBL1767471)
IC50 28700±n/a nM
Citation Botta, CBCabri, WCini, EDe Cesare, LFattorusso, CGiannini, GPersico, MPetrella, ARondinelli, FRodriquez, MRusso, ATaddei, M Oxime amides as a novel zinc binding group in histone deacetylase inhibitors: synthesis, biological activity, and computational evaluation. J Med Chem54:2165-82 (2011) 
 
Histone deacetylase 6
Name:Histone deacetylase 6
Type:Chromatin regulator; hydrolase; repressor
Mol. Mass.:131381.51
Organism:Homo sapiens (Human)
Description:Q9UBN7
Residue:1215
BDBM50341842
NameBDBM50341842
Synonyms:(S)-2-(Hydroxyimino)-8-((4-methoxybenzyl)amino)-N1methyl-N9-phenylnonanediamide | CHEMBL1767046
TypeSmall organic molecule
Emp. Form.C24H32N4O4
Mol. Mass.440.5353
SMILESCNC(=O)C(CCCCC[C@H](NCc1ccc(OC)cc1)C(=O)Nc1ccccc1)N=O