Reaction Details
TargetHistone deacetylase 7
LigandBDBM50341854
Substrate/Competitorn/a
Meas. Tech.ChEMBL_743703 (CHEMBL1767472)
IC50 29700±n/a nM
Citation Botta, CBCabri, WCini, EDe Cesare, LFattorusso, CGiannini, GPersico, MPetrella, ARondinelli, FRodriquez, MRusso, ATaddei, M Oxime amides as a novel zinc binding group in histone deacetylase inhibitors: synthesis, biological activity, and computational evaluation. J Med Chem54:2165-82 (2011) 
 
Histone deacetylase 7
Name:Histone deacetylase 7
Type:Chromatin regulator; hydrolase; repressor
Mol. Mass.:102942.62
Organism:Homo sapiens (Human)
Description:Q8WUI4
Residue:952
BDBM50341854
NameBDBM50341854
Synonyms:CHEMBL1767039 | N9-(3-(6-Chloropyridin-3-yl)phenyl)-2-(hydroxyimino)-N1-methylnonanediamide
TypeSmall organic molecule
Emp. Form.C21H25ClN4O3
Mol. Mass.416.901
SMILESCNC(=O)C(CCCCCCC(=O)Nc1cccc(c1)-c1ccc(Cl)nc1)N=O