Reaction Details
TargetHistone deacetylase 8
LigandBDBM50341844
Substrate/Competitorn/a
Meas. Tech.ChEMBL_743704 (CHEMBL1767518)
IC50 22600±n/a nM
Citation Botta, CBCabri, WCini, EDe Cesare, LFattorusso, CGiannini, GPersico, MPetrella, ARondinelli, FRodriquez, MRusso, ATaddei, M Oxime amides as a novel zinc binding group in histone deacetylase inhibitors: synthesis, biological activity, and computational evaluation. J Med Chem54:2165-82 (2011) 
 
Histone deacetylase 8
Name:Histone deacetylase 8
Type:Enzyme
Mol. Mass.:41749.60
Organism:Homo sapiens (Human)
Description:Q9BY41
Residue:377
BDBM50341844
NameBDBM50341844
Synonyms:2-(Hydroxyimino)-N1-methyl-N9-phenylnonanediamide | CHEMBL1767029
TypeSmall organic molecule
Emp. Form.C16H23N3O3
Mol. Mass.305.3721
SMILESCNC(=O)C(CCCCCCC(=O)Nc1ccccc1)N=O