Reaction Details
TargetPoly [ADP-ribose] polymerase 2
LigandBDBM39220
Substrate/Competitorn/a
Meas. Tech.ChEMBL_743712 (CHEMBL1767526)
IC50 1500±n/a nM
Citation Sunderland, PTWoon, ECDhami, ABergin, ABMahon, MFWood, PJJones, LATully, SRLloyd, MDThompson, ASJavaid, HMartin, NMThreadgill, MD 5-Benzamidoisoquinolin-1-ones and 5-(κ-carboxyalkyl)isoquinolin-1-ones as isoform-selective inhibitors of poly(ADP-ribose) polymerase 2 (PARP-2). J Med Chem54:2049-59 (2011) 
 
Poly [ADP-ribose] polymerase 2
Name:Poly [ADP-ribose] polymerase 2
Type:n/a
Mol. Mass.:63409.97
Organism:Mus musculus (Mouse)
Description:Alexis Biochemicals, Cat. no. ALX-201-064-C020
Residue:559
BDBM39220
NameBDBM39220
Synonyms:(1-oxidanylidene-2H-isoquinolin-5-yl) benzoate CHEMBL1584950 SMR000038018 benzoic acid (1-oxo-2H-isoquinolin-5-yl) ester | cid_659976
TypeSmall organic molecule
Emp. Form.C16H11NO3
Mol. Mass.265.2634
SMILESO=C(Oc1cccc2c1cc[nH]c2=O)c1ccccc1