Reaction Details
TargetPoly [ADP-ribose] polymerase 1
LigandBDBM50341861
Substrate/Competitorn/a
Meas. Tech.ChEMBL_743711 (CHEMBL1767525)
IC50 13900±n/a nM
Citation Sunderland, PTWoon, ECDhami, ABergin, ABMahon, MFWood, PJJones, LATully, SRLloyd, MDThompson, ASJavaid, HMartin, NMThreadgill, MD 5-Benzamidoisoquinolin-1-ones and 5-(κ-carboxyalkyl)isoquinolin-1-ones as isoform-selective inhibitors of poly(ADP-ribose) polymerase 2 (PARP-2). J Med Chem54:2049-59 (2011) 
 
Poly [ADP-ribose] polymerase 1
Name:Poly [ADP-ribose] polymerase 1
Type:n/a
Mol. Mass.:113114.22
Organism:Homo sapiens (Human)
Description:P09874
Residue:1014
BDBM50341861
NameBDBM50341861
Synonyms:5-Benzamidoisoquinolin-1-one | CHEMBL1767054
TypeSmall organic molecule
Emp. Form.C16H12N2O2
Mol. Mass.264.2787
SMILESO=C(Nc1cccc2c1cc[nH]c2=O)c1ccccc1