Reaction Details
TargetPoly [ADP-ribose] polymerase 1
LigandBDBM50341864
Substrate/Competitorn/a
Meas. Tech.ChEMBL_743711 (CHEMBL1767525)
IC50 10700±n/a nM
Citation Sunderland, PTWoon, ECDhami, ABergin, ABMahon, MFWood, PJJones, LATully, SRLloyd, MDThompson, ASJavaid, HMartin, NMThreadgill, MD 5-Benzamidoisoquinolin-1-ones and 5-(κ-carboxyalkyl)isoquinolin-1-ones as isoform-selective inhibitors of poly(ADP-ribose) polymerase 2 (PARP-2). J Med Chem54:2049-59 (2011) 
 
Poly [ADP-ribose] polymerase 1
Name:Poly [ADP-ribose] polymerase 1
Type:n/a
Mol. Mass.:113114.22
Organism:Homo sapiens (Human)
Description:P09874
Residue:1014
BDBM50341864
NameBDBM50341864
Synonyms:5-(4-Trifluoromethylbenzamido)isoquinolin-1-one | CHEMBL1767048
TypeSmall organic molecule
Emp. Form.C17H11F3N2O2
Mol. Mass.332.2766
SMILESFC(F)(F)c1ccc(cc1)C(=O)Nc1cccc2c1cc[nH]c2=O