Reaction Details
TargetPoly [ADP-ribose] polymerase 1
LigandBDBM50341867
Substrate/Competitorn/a
Meas. Tech.ChEMBL_743711 (CHEMBL1767525)
IC50 7600±n/a nM
Citation Sunderland, PTWoon, ECDhami, ABergin, ABMahon, MFWood, PJJones, LATully, SRLloyd, MDThompson, ASJavaid, HMartin, NMThreadgill, MD 5-Benzamidoisoquinolin-1-ones and 5-(κ-carboxyalkyl)isoquinolin-1-ones as isoform-selective inhibitors of poly(ADP-ribose) polymerase 2 (PARP-2). J Med Chem54:2049-59 (2011) 
 
Poly [ADP-ribose] polymerase 1
Name:Poly [ADP-ribose] polymerase 1
Type:n/a
Mol. Mass.:113114.22
Organism:Homo sapiens (Human)
Description:P09874
Residue:1014
BDBM50341867
NameBDBM50341867
Synonyms:5-(4-Iodobenzamido)isoquinolin-1-one | CHEMBL1767053
TypeSmall organic molecule
Emp. Form.C16H11IN2O2
Mol. Mass.390.1752
SMILESIc1ccc(cc1)C(=O)Nc1cccc2c1cc[nH]c2=O