Reaction Details
TargetPoly [ADP-ribose] polymerase 2
LigandBDBM50341875
Substrate/Competitorn/a
Meas. Tech.ChEMBL_743712 (CHEMBL1767526)
IC50>25000±n/a nM
Citation Sunderland, PTWoon, ECDhami, ABergin, ABMahon, MFWood, PJJones, LATully, SRLloyd, MDThompson, ASJavaid, HMartin, NMThreadgill, MD 5-Benzamidoisoquinolin-1-ones and 5-(κ-carboxyalkyl)isoquinolin-1-ones as isoform-selective inhibitors of poly(ADP-ribose) polymerase 2 (PARP-2). J Med Chem54:2049-59 (2011) 
 
Poly [ADP-ribose] polymerase 2
Name:Poly [ADP-ribose] polymerase 2
Type:n/a
Mol. Mass.:63409.97
Organism:Mus musculus (Mouse)
Description:Alexis Biochemicals, Cat. no. ALX-201-064-C020
Residue:559
BDBM50341875
NameBDBM50341875
Synonyms:1-Oxoisoquinoline-5-carboxylic acid | CHEMBL1767062
TypeSmall organic molecule
Emp. Form.C10H7NO3
Mol. Mass.189.1675
SMILESOC(=O)c1cccc2c1cc[nH]c2=O