Reaction Details
TargetP2Y purinoceptor 4
LigandBDBM50341880
Substrate/Competitorn/a
Meas. Tech.ChEMBL_743286 (CHEMBL1767485)
EC50 23±n/a nM
Citation El-Tayeb, AQi, ANicholas, RAMüller, CE Structural modifications of UMP, UDP, and UTP leading to subtype-selective agonists for P2Y2, P2Y4, and P2Y6 receptors. J Med Chem54:2878-90 (2011) 
 
P2Y purinoceptor 4
Name:P2Y purinoceptor 4
Type:PROTEIN
Mol. Mass.:40977.17
Organism:Homo sapiens (Human)
Description:ChEMBL_751027
Residue:365
BDBM50341880
NameBDBM50341880
Synonyms:((2R,3S,4R,5R)-3,4-dihydroxy-5-(2-oxo-4-thioxo-3,4-dihydropyrimidin-1(2H)-yl)tetrahydrofuran-2-yl)methyl triphosphate | CHEMBL1767409
TypeSmall organic molecule
Emp. Form.C9H15N2O14P3S
Mol. Mass.500.207
SMILESO[C@H]1[C@@H](O)[C@@H](O[C@@H]1COP(O)(=O)OP(O)(=O)OP(O)(O)=O)n1ccc(=S)[nH]c1=O