Reaction Details
TargetP2Y purinoceptor 2
LigandBDBM50118239
Substrate/Competitorn/a
Meas. Tech.ChEMBL_743275 (CHEMBL1769029)
EC50 16500±n/a nM
Citation El-Tayeb, AQi, ANicholas, RAMüller, CE Structural modifications of UMP, UDP, and UTP leading to subtype-selective agonists for P2Y2, P2Y4, and P2Y6 receptors. J Med Chem54:2878-90 (2011) 
 
P2Y purinoceptor 2
Name:P2Y purinoceptor 2
Type:PROTEIN
Mol. Mass.:42299.21
Organism:Homo sapiens (Human)
Description:ChEMBL_1455361
Residue:377
BDBM50118239
NameBDBM50118239
Synonyms:CHEMBL130266 Uridine diphosphate | uridine 5'-(trihydrogen diphosphate)
TypeSmall organic molecule
Emp. Form.C9H14N2O12P2
Mol. Mass.404.1612
SMILESO[C@@H]1[C@@H](COP(O)(=O)OP(O)(O)=O)O[C@H]([C@@H]1O)n1ccc(=O)[nH]c1=O