Reaction Details
TargetCannabinoid receptor 1
LigandBDBM50341920
Substrate/Competitorn/a
Meas. Tech.ChEMBL_743423 (CHEMBL1767777)
IC50>17000±n/a nM
Citation Manley, PJZartman, APaone, DVBurgey, CSHenze, DADella Penna, KDesai, RLeitl, MDLemaire, WWhite, RBYeh, SUrban, MOKane, SAHartman, GDBilodeau, MTTrotter, BW Decahydroquinoline amides as highly selective CB2 agonists: role of selectivity on in vivo efficacy in a rodent model of analgesia. Bioorg Med Chem Lett21:2359-64 (2011) 
 
Cannabinoid receptor 1
Name:Cannabinoid receptor 1
Type:G Protein-Coupled Receptor (GPCR)
Mol. Mass.:52868.96
Organism:Homo sapiens (Human)
Description:P21554
Residue:472
BDBM50341920
NameBDBM50341920
Synonyms:((4aR,8aS)-4-hydroxy-4-phenyloctahydroquinolin-1(2H)-yl)(2-(pyridin-4-yl)thiazol-4-yl)methanone (3-(2-fluorophenyl)-1H-pyrazol-5-yl)((4aR,8aS)-4-hydroxy-4-phenyloctahydroquinolin-1(2H)-yl)methanone | CHEMBL1765092
TypeSmall organic molecule
Emp. Form.C24H25N3O2S
Mol. Mass.419.539
SMILESOC1(CCN([C@H]2CCCC[C@@H]12)C(=O)c1csc(n1)-c1ccncc1)c1ccccc1