Reaction Details
TargetCannabinoid receptor 1
LigandBDBM50341928
Substrate/Competitorn/a
Meas. Tech.ChEMBL_743423 (CHEMBL1767777)
IC50 312±n/a nM
Citation Manley, PJZartman, APaone, DVBurgey, CSHenze, DADella Penna, KDesai, RLeitl, MDLemaire, WWhite, RBYeh, SUrban, MOKane, SAHartman, GDBilodeau, MTTrotter, BW Decahydroquinoline amides as highly selective CB2 agonists: role of selectivity on in vivo efficacy in a rodent model of analgesia. Bioorg Med Chem Lett21:2359-64 (2011) 
 
Cannabinoid receptor 1
Name:Cannabinoid receptor 1
Type:G Protein-Coupled Receptor (GPCR)
Mol. Mass.:52868.96
Organism:Homo sapiens (Human)
Description:P21554
Residue:472
BDBM50341928
NameBDBM50341928
Synonyms:CHEMBL1765160 | cis-(4-chlorophenyl)((4R,4aS,8aR)-4-hydroxy-4-phenyloctahydroquinolin-1(2H)-yl)methanone
TypeSmall organic molecule
Emp. Form.C22H24ClNO2
Mol. Mass.369.884
SMILESO[C@@]1(CCN([C@@H]2CCCC[C@H]12)C(=O)c1ccc(Cl)cc1)c1ccccc1