Reaction Details
TargetCannabinoid receptor 1
LigandBDBM50341943
Substrate/Competitorn/a
Meas. Tech.ChEMBL_743423 (CHEMBL1767777)
IC50>17000±n/a nM
Citation Manley, PJZartman, APaone, DVBurgey, CSHenze, DADella Penna, KDesai, RLeitl, MDLemaire, WWhite, RBYeh, SUrban, MOKane, SAHartman, GDBilodeau, MTTrotter, BW Decahydroquinoline amides as highly selective CB2 agonists: role of selectivity on in vivo efficacy in a rodent model of analgesia. Bioorg Med Chem Lett21:2359-64 (2011) 
 
Cannabinoid receptor 1
Name:Cannabinoid receptor 1
Type:G Protein-Coupled Receptor (GPCR)
Mol. Mass.:52868.96
Organism:Homo sapiens (Human)
Description:P21554
Residue:472
BDBM50341943
NameBDBM50341943
Synonyms:CHEMBL1765268 | cis-rac-((4S,4aR,8aS)-4-hydroxy-4-phenyloctahydroquinolin-1(2H)-yl)(6-(2,2,2-trifluoroethoxy)pyridin-3-yl)methanone
TypeSmall organic molecule
Emp. Form.C23H25F3N2O3
Mol. Mass.434.4514
SMILESO[C@]1(CCN([C@H]2CCCC[C@@H]12)C(=O)c1ccc(OCC(F)(F)F)nc1)c1ccccc1