Reaction Details
TargetCannabinoid receptor 2
LigandBDBM50341930
Substrate/Competitorn/a
Meas. Tech.ChEMBL_743422 (CHEMBL1767776)
IC50 0.62±n/a nM
Citation Manley, PJZartman, APaone, DVBurgey, CSHenze, DADella Penna, KDesai, RLeitl, MDLemaire, WWhite, RBYeh, SUrban, MOKane, SAHartman, GDBilodeau, MTTrotter, BW Decahydroquinoline amides as highly selective CB2 agonists: role of selectivity on in vivo efficacy in a rodent model of analgesia. Bioorg Med Chem Lett21:2359-64 (2011) 
 
Cannabinoid receptor 2
Name:Cannabinoid receptor 2
Type:G Protein-Coupled Receptor (GPCR)
Mol. Mass.:39690.94
Organism:Homo sapiens (Human)
Description:P34972
Residue:360
BDBM50341930
NameBDBM50341930
Synonyms:CHEMBL1765246 | cis-((4R,4aS,8aR)-4-hydroxy-4-phenyloctahydroquinolin-1(2H)-yl)(1H-indol-4-yl)methanone
TypeSmall organic molecule
Emp. Form.C24H26N2O2
Mol. Mass.374.4754
SMILESO[C@@]1(CCN([C@@H]2CCCC[C@H]12)C(=O)c1cccc2[nH]ccc12)c1ccccc1