Reaction Details
TargetCannabinoid receptor 2
LigandBDBM50341966
Substrate/Competitorn/a
Meas. Tech.ChEMBL_743422 (CHEMBL1767776)
IC50 155±n/a nM
Citation Manley, PJZartman, APaone, DVBurgey, CSHenze, DADella Penna, KDesai, RLeitl, MDLemaire, WWhite, RBYeh, SUrban, MOKane, SAHartman, GDBilodeau, MTTrotter, BW Decahydroquinoline amides as highly selective CB2 agonists: role of selectivity on in vivo efficacy in a rodent model of analgesia. Bioorg Med Chem Lett21:2359-64 (2011) 
 
Cannabinoid receptor 2
Name:Cannabinoid receptor 2
Type:G Protein-Coupled Receptor (GPCR)
Mol. Mass.:39690.94
Organism:Homo sapiens (Human)
Description:P34972
Residue:360
BDBM50341966
NameBDBM50341966
Synonyms:CHEMBL1765252 | trans-((4R,4aS,8aS)-4-(4-chlorophenyl)-4-hydroxyoctahydroquinolin-1(2H)-yl)(phenyl)methanone
TypeSmall organic molecule
Emp. Form.C22H24ClNO2
Mol. Mass.369.884
SMILESO[C@@]1(CCN([C@H]2CCCC[C@H]12)C(=O)c1ccccc1)c1ccc(Cl)cc1