Reaction Details
TargetCannabinoid receptor 2
LigandBDBM50341968
Substrate/Competitorn/a
Meas. Tech.ChEMBL_743422 (CHEMBL1767776)
IC50 1045±n/a nM
Citation Manley, PJZartman, APaone, DVBurgey, CSHenze, DADella Penna, KDesai, RLeitl, MDLemaire, WWhite, RBYeh, SUrban, MOKane, SAHartman, GDBilodeau, MTTrotter, BW Decahydroquinoline amides as highly selective CB2 agonists: role of selectivity on in vivo efficacy in a rodent model of analgesia. Bioorg Med Chem Lett21:2359-64 (2011) 
 
Cannabinoid receptor 2
Name:Cannabinoid receptor 2
Type:G Protein-Coupled Receptor (GPCR)
Mol. Mass.:39690.94
Organism:Homo sapiens (Human)
Description:P34972
Residue:360
BDBM50341968
NameBDBM50341968
Synonyms:CHEMBL1765254 | trans-3-((4R,4aS,8aS)-1-benzoyl-4-hydroxydecahydroquinolin-4-yl)benzonitrile
TypeSmall organic molecule
Emp. Form.C23H24N2O2
Mol. Mass.360.4489
SMILESO[C@@]1(CCN([C@H]2CCCC[C@H]12)C(=O)c1ccccc1)c1cccc(c1)C#N