Reaction Details
TargetCannabinoid receptor 2
LigandBDBM50341934
Substrate/Competitorn/a
Meas. Tech.ChEMBL_743422 (CHEMBL1767776)
IC50 0.53±n/a nM
Citation Manley, PJZartman, APaone, DVBurgey, CSHenze, DADella Penna, KDesai, RLeitl, MDLemaire, WWhite, RBYeh, SUrban, MOKane, SAHartman, GDBilodeau, MTTrotter, BW Decahydroquinoline amides as highly selective CB2 agonists: role of selectivity on in vivo efficacy in a rodent model of analgesia. Bioorg Med Chem Lett21:2359-64 (2011) 
 
Cannabinoid receptor 2
Name:Cannabinoid receptor 2
Type:G Protein-Coupled Receptor (GPCR)
Mol. Mass.:39690.94
Organism:Homo sapiens (Human)
Description:P34972
Residue:360
BDBM50341934
NameBDBM50341934
Synonyms:CHEMBL1765259 | cis-rac-((4S,4aR,8aS)-4-hydroxy-4-phenyloctahydroquinolin-1(2H)-yl)(quinolin-6-yl)methanone
TypeSmall organic molecule
Emp. Form.C25H26N2O2
Mol. Mass.386.4861
SMILESO[C@]1(CCN([C@H]2CCCC[C@@H]12)C(=O)c1ccc2ncccc2c1)c1ccccc1