Reaction Details
TargetCannabinoid receptor 2
LigandBDBM50341948
Substrate/Competitorn/a
Meas. Tech.ChEMBL_743422 (CHEMBL1767776)
IC50 62±n/a nM
Citation Manley, PJZartman, APaone, DVBurgey, CSHenze, DADella Penna, KDesai, RLeitl, MDLemaire, WWhite, RBYeh, SUrban, MOKane, SAHartman, GDBilodeau, MTTrotter, BW Decahydroquinoline amides as highly selective CB2 agonists: role of selectivity on in vivo efficacy in a rodent model of analgesia. Bioorg Med Chem Lett21:2359-64 (2011) 
 
Cannabinoid receptor 2
Name:Cannabinoid receptor 2
Type:G Protein-Coupled Receptor (GPCR)
Mol. Mass.:39690.94
Organism:Homo sapiens (Human)
Description:P34972
Residue:360
BDBM50341948
NameBDBM50341948
Synonyms:CHEMBL1765273 | cis-rac-((4S,4aR,8aS)-4-hydroxy-4-phenyloctahydroquinolin-1(2H)-yl)(piperazin-2-yl)methanone
TypeSmall organic molecule
Emp. Form.C20H29N3O2
Mol. Mass.343.4632
SMILESO[C@]1(CCN([C@H]2CCCC[C@@H]12)C(=O)C1CNCCN1)c1ccccc1