Reaction Details
TargetCannabinoid receptor 2
LigandBDBM50341950
Substrate/Competitorn/a
Meas. Tech.ChEMBL_743422 (CHEMBL1767776)
IC50 2175±n/a nM
Citation Manley, PJZartman, APaone, DVBurgey, CSHenze, DADella Penna, KDesai, RLeitl, MDLemaire, WWhite, RBYeh, SUrban, MOKane, SAHartman, GDBilodeau, MTTrotter, BW Decahydroquinoline amides as highly selective CB2 agonists: role of selectivity on in vivo efficacy in a rodent model of analgesia. Bioorg Med Chem Lett21:2359-64 (2011) 
 
Cannabinoid receptor 2
Name:Cannabinoid receptor 2
Type:G Protein-Coupled Receptor (GPCR)
Mol. Mass.:39690.94
Organism:Homo sapiens (Human)
Description:P34972
Residue:360
BDBM50341950
NameBDBM50341950
Synonyms:CHEMBL1765275 | cis-rac-((4S,4aR,8aS)-4-hydroxy-4-phenyloctahydroquinolin-1(2H)-yl)((2S,4S)-4-hydroxypiperidin-2-yl)methanone
TypeSmall organic molecule
Emp. Form.C21H30N2O3
Mol. Mass.358.4745
SMILESO[C@H]1CCN[C@@H](C1)C(=O)N1CC[C@](O)([C@@H]2CCCC[C@H]12)c1ccccc1