Reaction Details
TargetCannabinoid receptor 2
LigandBDBM50341959
Substrate/Competitorn/a
Meas. Tech.ChEMBL_743422 (CHEMBL1767776)
IC50 135±n/a nM
Citation Manley, PJZartman, APaone, DVBurgey, CSHenze, DADella Penna, KDesai, RLeitl, MDLemaire, WWhite, RBYeh, SUrban, MOKane, SAHartman, GDBilodeau, MTTrotter, BW Decahydroquinoline amides as highly selective CB2 agonists: role of selectivity on in vivo efficacy in a rodent model of analgesia. Bioorg Med Chem Lett21:2359-64 (2011) 
 
Cannabinoid receptor 2
Name:Cannabinoid receptor 2
Type:G Protein-Coupled Receptor (GPCR)
Mol. Mass.:39690.94
Organism:Homo sapiens (Human)
Description:P34972
Residue:360
BDBM50341959
NameBDBM50341959
Synonyms:CHEMBL1765285 | cis-rac-5-((4S,4aR,8aS)-4-hydroxy-4-phenyldecahydroquinoline-1-carbonyl)-1-methylpiperidin-2-one
TypeSmall organic molecule
Emp. Form.C22H30N2O3
Mol. Mass.370.4852
SMILESCN1CC(CCC1=O)C(=O)N1CC[C@](O)([C@@H]2CCCC[C@H]12)c1ccccc1