Reaction Details
TargetTYR_PHOSPHATASE_2 domain-containing protein
LigandBDBM50341982
Substrate/Competitorn/a
Meas. Tech.ChEMBL_743570 (CHEMBL1768070)
Ki 150±n/a nM
Citation Vintonyak, VVWaldmann, HRauh, D Using small molecules to target protein phosphatases. Bioorg Med Chem19:2145-55 (2011) 
 
TYR_PHOSPHATASE_2 domain-containing protein
Name:TYR_PHOSPHATASE_2 domain-containing protein
Type:Hydrolase
Mol. Mass.:30152.45
Organism:Mycobacterium tuberculosis
Description:n/a
Residue:276
BDBM50341982
NameBDBM50341982
Synonyms:5-(2-cyclohexyl-4-((1-(6-(4-fluoro-2-methylphenylsulfonamido)hexyl)-1H-1,2,3-triazol-4-yl)methoxy)phenyl)isoxazole-3-carboxylic acid | CHEMBL1765363
TypeSmall organic molecule
Emp. Form.C32H38FN5O6S
Mol. Mass.639.737
SMILESCc1cc(F)ccc1S(=O)(=O)NCCCCCCn1cc(COc2ccc(-c3cc(no3)C(O)=O)c(c2)C2CCCCC2)nn1