Reaction Details
TargetFatty-acid amide hydrolase 1
LigandBDBM50342071
Substrate/Competitorn/a
Meas. Tech.ChEMBL_743931 (CHEMBL1767925)
Ki 3.2±n/a nM
Citation Ezzili, CMileni, MMcGlinchey, NLong, JZKinsey, SGHochstatter, DGStevens, RCLichtman, AHCravatt, BFBilsky, EJBoger, DL Reversible competitivea-ketoheterocycle inhibitors of fatty acid amide hydrolase containing additional conformational constraints in the acyl side chain: orally active, long-acting analgesics. J Med Chem54:2805-22 (2011) 
 
Fatty-acid amide hydrolase 1
Name:Fatty-acid amide hydrolase 1
Type:Protein
Mol. Mass.:63071.19
Organism:Homo sapiens (Human)
Description:O00519
Residue:579
BDBM50342071
NameBDBM50342071
Synonyms:(S)-(6-(benzyloxy)-1,2,3,4-tetrahydronaphthalen-2-yl)(5-(pyridin-2-yl)oxazol-2-yl)methanone | CHEMBL1765837
TypeSmall organic molecule
Emp. Form.C26H22N2O3
Mol. Mass.410.4645
SMILESO=C([C@H]1CCc2cc(OCc3ccccc3)ccc2C1)c1ncc(o1)-c1ccccn1