Reaction Details
TargetFatty-acid amide hydrolase 1
LigandBDBM50342103
Substrate/Competitorn/a
Meas. Tech.ChEMBL_743931 (CHEMBL1767925)
Ki>24±n/a nM
Citation Ezzili, CMileni, MMcGlinchey, NLong, JZKinsey, SGHochstatter, DGStevens, RCLichtman, AHCravatt, BFBilsky, EJBoger, DL Reversible competitivea-ketoheterocycle inhibitors of fatty acid amide hydrolase containing additional conformational constraints in the acyl side chain: orally active, long-acting analgesics. J Med Chem54:2805-22 (2011) 
 
Fatty-acid amide hydrolase 1
Name:Fatty-acid amide hydrolase 1
Type:Protein
Mol. Mass.:63071.19
Organism:Homo sapiens (Human)
Description:O00519
Residue:579
BDBM50342103
NameBDBM50342103
Synonyms:CHEMBL1765869 | rac-(5-(Benzyloxy)indan-2-yl)(oxazol-2-yl)methanone
TypeSmall organic molecule
Emp. Form.C20H17NO3
Mol. Mass.319.3539
SMILESO=C(C1Cc2ccc(OCc3ccccc3)cc2C1)c1ncco1