Reaction Details
TargetFatty-acid amide hydrolase 1
LigandBDBM50342124
Substrate/Competitorn/a
Meas. Tech.ChEMBL_743931 (CHEMBL1767925)
Ki 1.6±n/a nM
Citation Ezzili, CMileni, MMcGlinchey, NLong, JZKinsey, SGHochstatter, DGStevens, RCLichtman, AHCravatt, BFBilsky, EJBoger, DL Reversible competitivea-ketoheterocycle inhibitors of fatty acid amide hydrolase containing additional conformational constraints in the acyl side chain: orally active, long-acting analgesics. J Med Chem54:2805-22 (2011) 
 
Fatty-acid amide hydrolase 1
Name:Fatty-acid amide hydrolase 1
Type:Protein
Mol. Mass.:63071.19
Organism:Homo sapiens (Human)
Description:O00519
Residue:579
BDBM50342124
NameBDBM50342124
Synonyms:(R)-methyl 5-(6-phenoxy-1,2,3,4-tetrahydronaphthalene-2-carbonyl)-1,3,4-oxadiazole-2-carboxylate | CHEMBL1765990
TypeSmall organic molecule
Emp. Form.C21H18N2O5
Mol. Mass.378.378
SMILESCOC(=O)c1nnc(o1)C(=O)[C@@H]1CCc2cc(Oc3ccccc3)ccc2C1