Reaction Details
TargetCytochrome P450 3A4
LigandBDBM50342128
Substrate/Competitorn/a
Meas. Tech.ChEMBL_742780 (CHEMBL1769739)
IC50 8000±n/a nM
Citation Gomaa, MSBridgens, CEAboraia, ASVeal, GJRedfern, CPBrancale, AArmstrong, JLSimons, C Small molecule inhibitors of retinoic acid 4-hydroxylase (CYP26): synthesis and biological evaluation of imidazole methyl 3-(4-(aryl-2-ylamino)phenyl)propanoates. J Med Chem54:2778-91 (2011) 
 
Cytochrome P450 3A4
Name:Cytochrome P450 3A4
Type:Enzyme
Mol. Mass.:57349.57
Organism:Homo sapiens (Human)
Description:n/a
Residue:503
BDBM50342128
NameBDBM50342128
Synonyms:3-Imidazol-1-yl-2-methyl-3-[4-(naphthalen-2-ylamino)-phenyl]-propionicAcid Methyl Ester | CHEMBL1766005
TypeSmall organic molecule
Emp. Form.C25H25N3O2
Mol. Mass.399.4849
SMILESCOC(=O)C(C)(C)C(c1ccc(Nc2ccc3ccccc3c2)cc1)n1ccnc1