Reaction Details
TargetCytochrome P450 26A1
LigandBDBM50342144
Substrate/Competitorn/a
Meas. Tech.ChEMBL_744044 (CHEMBL1768149)
IC50 125±n/a nM
Citation Gomaa, MSBridgens, CEAboraia, ASVeal, GJRedfern, CPBrancale, AArmstrong, JLSimons, C Small molecule inhibitors of retinoic acid 4-hydroxylase (CYP26): synthesis and biological evaluation of imidazole methyl 3-(4-(aryl-2-ylamino)phenyl)propanoates. J Med Chem54:2778-91 (2011) 
 
Cytochrome P450 26A1
Name:Cytochrome P450 26A1
Type:Enzyme
Mol. Mass.:56216.16
Organism:Homo sapiens (Human)
Description:O43174
Residue:497
BDBM50342144
NameBDBM50342144
Synonyms:3-[4-(2-Ethoxy-naphthalen-1-ylamino)-phenyl]-3-imidazol-1-yl-2,2-dimethyl-propionic Acid Methyl Ester | CHEMBL1766004
TypeSmall organic molecule
Emp. Form.C27H29N3O3
Mol. Mass.443.5375
SMILESCCOc1ccc2ccccc2c1Nc1ccc(cc1)C(n1ccnc1)C(C)(C)C(=O)OC