Reaction Details
TargetSteroid 17-alpha-hydroxylase/17,20 lyase
LigandBDBM50342170
Substrate/Competitorn/a
Meas. Tech.ChEMBL_742803 (CHEMBL1769806)
IC50 19±n/a nM
Citation Kaku, TTsujimoto, SMatsunaga, NTanaka, THara, TYamaoka, MKusaka, MTasaka, A 17,20-Lyase inhibitors. Part 3: Design, synthesis, and structure-activity relationships of biphenylylmethylimidazole derivatives as novel 17,20-lyase inhibitors. Bioorg Med Chem19:2428-42 (2011) 
 
Steroid 17-alpha-hydroxylase/17,20 lyase
Name:Steroid 17-alpha-hydroxylase/17,20 lyase
Type:Enzyme
Mol. Mass.:57255.68
Organism:Rattus norvegicus (Rat)
Description:P11715
Residue:507
BDBM50342170
NameBDBM50342170
Synonyms:CHEMBL1766171 | rac-1-(4'-Chloro[1,1'-biphenyl]-3-yl)-1-(1H-imidazol-4-yl)-2-methyl-1-propanol
TypeSmall organic molecule
Emp. Form.C19H19ClN2O
Mol. Mass.326.82
SMILESCC(C)C(O)(c1cnc[nH]1)c1cccc(c1)-c1ccc(Cl)cc1