Reaction Details
TargetSteroid 17-alpha-hydroxylase/17,20 lyase
LigandBDBM50342179
Substrate/Competitorn/a
Meas. Tech.ChEMBL_742804 (CHEMBL1769807)
IC50 21±n/a nM
Citation Kaku, TTsujimoto, SMatsunaga, NTanaka, THara, TYamaoka, MKusaka, MTasaka, A 17,20-Lyase inhibitors. Part 3: Design, synthesis, and structure-activity relationships of biphenylylmethylimidazole derivatives as novel 17,20-lyase inhibitors. Bioorg Med Chem19:2428-42 (2011) 
 
Steroid 17-alpha-hydroxylase/17,20 lyase
Name:Steroid 17-alpha-hydroxylase/17,20 lyase
Type:Enzyme
Mol. Mass.:57382.42
Organism:Homo sapiens (Human)
Description:E.coli expressing human CYP17
Residue:508
BDBM50342179
NameBDBM50342179
Synonyms:CHEMBL1766180 | rac-N-{4'-[1-Hydroxy-1-(1H-imidazol-4-yl)-2-methylpropyl][1,1'-biphenyl]-3-yl}-N'-methylurea
TypeSmall organic molecule
Emp. Form.C21H24N4O2
Mol. Mass.364.4409
SMILESCNC(=O)Nc1cccc(c1)-c1ccc(cc1)C(O)(C(C)C)c1cnc[nH]1