Reaction Details
TargetNeurotensin receptor type 1
LigandBDBM50130880
Substrate/Competitorn/a
Meas. Tech.ChEMBL_743646 (CHEMBL1768189)
Kd 0.590000±n/a nM
Citation Einsiedel, JHeld, CHervet, MPlomer, MTschammer, NHübner, HGmeiner, P Discovery of highly potent and neurotensin receptor 2 selective neurotensin mimetics. J Med Chem54:2915-23 (2011) 
 
Neurotensin receptor type 1
Name:Neurotensin receptor type 1
Type:PROTEIN
Mol. Mass.:46278.89
Organism:Homo sapiens (Human)
Description:ChEMBL_1453811
Residue:418
BDBM50130880
NameBDBM50130880
Synonyms:CHEMBL407196 neurotensin pGlu-Leu-Tyr-Glu-Asn-Lys-Pro-Arg-Arg-Pro-Tyr-Ile-Leu-OH
TypeSmall organic molecule
Emp. Form.C78H121N21O20
Mol. Mass.1672.924
SMILES[#6]-[#6]-[#6@H](-[#6])-[#6@H](-[#7]-[#6](=O)-[#6@H](-[#6]-c1ccc(-[#8])cc1)-[#7]-[#6](=O)-[#6@@H]-1-[#6]-[#6]-[#6]-[#7]-1-[#6](=O)-[#6@H](-[#6]-[#6]-[#6]\[#7]=[#6](/[#7])-[#7])-[#7]-[#6](=O)-[#6@H](-[#6]-[#6]-[#6]\[#7]=[#6](\[#7])-[#7])-[#7]-[#6](=O)-[#6@@H]-1-[#6]-[#6]-[#6]-[#7]-1-[#6](=O)-[#6@H](-[#6]-[#6]-[#6]-[#6]-[#7])-[#7]-[#6](=O)-[#6@H](-[#6]-[#6](-[#7])=O)-[#7]-[#6](=O)-[#6@H](-[#6]-[#6]-[#6](-[#8])=O)-[#7]-[#6](=O)-[#6@H](-[#6]-c1ccc(-[#8])cc1)-[#7]-[#6](=O)-[#6@H](-[#6]-[#6](-[#6])-[#6])-[#7]-[#6](=O)-[#6@@H]-1-[#6]-[#6]-[#6](=O)-[#7]-1)-[#6](=O)-[#7]-[#6@@H](-[#6]-[#6](-[#6])-[#6])-[#6](-[#8])=O