Reaction Details
TargetMitogen-activated protein kinase 8
LigandBDBM50342301
Substrate/Competitorn/a
Meas. Tech.ChEMBL_744058 (CHEMBL1768208)
IC50 4620±n/a nM
Citation De, SKBarile, EChen, VStebbins, JLCellitti, JFMachleidt, TCarlson, CBYang, LDahl, RPellecchia, M Design, synthesis, and structure-activity relationship studies of thiophene-3-carboxamide derivatives as dual inhibitors of the c-Jun N-terminal kinase. Bioorg Med Chem19:2582-8 (2011) 
 
Mitogen-activated protein kinase 8
Name:Mitogen-activated protein kinase 8
Type:Enzyme
Mol. Mass.:48297.57
Organism:Homo sapiens (Human)
Description:JNK-1 was purchased from Upstate Cell Signaling Solutions (formerly Upstate Biotechnology).
Residue:427
BDBM50342301
NameBDBM50342301
Synonyms:2-(2-(benzo[b]thiophen-3-yl)acetamido)thiophene-3-carboxamide | CHEMBL1767254
TypeSmall organic molecule
Emp. Form.C15H12N2O2S2
Mol. Mass.316.398
SMILESNC(=O)c1ccsc1NC(=O)Cc1csc2ccccc12