Reaction Details
TargetHydroxycarboxylic acid receptor 2
LigandBDBM23533
Substrate/Competitorn/a
Meas. Tech.ChEMBL_744661 (CHEMBL1772682)
IC50 6±n/a nM
Citation Imbriglio, JEDiRocco, DBodner, RRaghavan, SChen, WMarley, DEsser, CHolt, TGWolff, MSTaggart, AKWaters, MGTata, JRColletti, SL The discovery of high affinity agonists of GPR109a with reduced serum shift and improved ADME properties. Bioorg Med Chem Lett21:2721-4 (2011) 
 
Hydroxycarboxylic acid receptor 2
Name:Hydroxycarboxylic acid receptor 2
Type:G Protein-Coupled Receptor (GPCR)
Mol. Mass.:41868.22
Organism:Homo sapiens (Human)
Description:Membranes from CHO cells expressing the recombinant human GPR109A were used in competition binding assay.
Residue:363
BDBM23533
NameBDBM23533
Synonyms:2-{3-[3-(5-hydroxypyridin-2-yl)-1,2,4-oxadiazol-5-yl]propanamido}benzoic acid | Biaryl Anthranilide Analogue, 2o
TypeSmall organic molecule
Emp. Form.C17H14N4O5
Mol. Mass.354.3169
SMILESOC(=O)c1ccccc1NC(=O)CCc1nc(no1)-c1ccc(O)cn1