Reaction Details
TargetHydroxycarboxylic acid receptor 2
LigandBDBM23525
Substrate/Competitorn/a
Meas. Tech.ChEMBL_744661 (CHEMBL1772682)
IC50 1±n/a nM
Citation Imbriglio, JEDiRocco, DBodner, RRaghavan, SChen, WMarley, DEsser, CHolt, TGWolff, MSTaggart, AKWaters, MGTata, JRColletti, SL The discovery of high affinity agonists of GPR109a with reduced serum shift and improved ADME properties. Bioorg Med Chem Lett21:2721-4 (2011) 
 
Hydroxycarboxylic acid receptor 2
Name:Hydroxycarboxylic acid receptor 2
Type:G Protein-Coupled Receptor (GPCR)
Mol. Mass.:41868.22
Organism:Homo sapiens (Human)
Description:Membranes from CHO cells expressing the recombinant human GPR109A were used in competition binding assay.
Residue:363
BDBM23525
NameBDBM23525
Synonyms:2-{3-[2-(2-chloro-4-hydroxyphenyl)-1,3-thiazol-5-yl]propanamido}benzoic acid | Biaryl Anthranilide Analogue, 2g
TypeSmall organic molecule
Emp. Form.C19H15ClN2O4S
Mol. Mass.402.851
SMILESOC(=O)c1ccccc1NC(=O)CCc1cnc(s1)-c1ccc(O)cc1Cl