Reaction Details
TargetHydroxycarboxylic acid receptor 2
LigandBDBM50342533
Substrate/Competitorn/a
Meas. Tech.ChEMBL_744662 (CHEMBL1772683)
EC50 65±n/a nM
Citation Imbriglio, JEDiRocco, DBodner, RRaghavan, SChen, WMarley, DEsser, CHolt, TGWolff, MSTaggart, AKWaters, MGTata, JRColletti, SL The discovery of high affinity agonists of GPR109a with reduced serum shift and improved ADME properties. Bioorg Med Chem Lett21:2721-4 (2011) 
 
Hydroxycarboxylic acid receptor 2
Name:Hydroxycarboxylic acid receptor 2
Type:G Protein-Coupled Receptor (GPCR)
Mol. Mass.:41868.22
Organism:Homo sapiens (Human)
Description:Membranes from CHO cells expressing the recombinant human GPR109A were used in competition binding assay.
Residue:363
BDBM50342533
NameBDBM50342533
Synonyms:2-(3-(7-hydroxy-4,5-dihydropyrazolo[1,5-a]quinolin-2-yl)propanamido)benzoic acid | CHEMBL1770173
TypeSmall organic molecule
Emp. Form.C21H19N3O4
Mol. Mass.377.3933
SMILESOC(=O)c1ccccc1NC(=O)CCc1cc2CCc3cc(O)ccc3-n2n1