Reaction Details
TargetHydroxycarboxylic acid receptor 2
LigandBDBM23527
Substrate/Competitorn/a
Meas. Tech.ChEMBL_744662 (CHEMBL1772683)
EC50 120±n/a nM
Citation Imbriglio, JEDiRocco, DBodner, RRaghavan, SChen, WMarley, DEsser, CHolt, TGWolff, MSTaggart, AKWaters, MGTata, JRColletti, SL The discovery of high affinity agonists of GPR109a with reduced serum shift and improved ADME properties. Bioorg Med Chem Lett21:2721-4 (2011) 
 
Hydroxycarboxylic acid receptor 2
Name:Hydroxycarboxylic acid receptor 2
Type:G Protein-Coupled Receptor (GPCR)
Mol. Mass.:41868.22
Organism:Homo sapiens (Human)
Description:Membranes from CHO cells expressing the recombinant human GPR109A were used in competition binding assay.
Residue:363
BDBM23527
NameBDBM23527
Synonyms:2-{3-[3-(4-hydroxyphenyl)-1,2,4-oxadiazol-5-yl]propanamido}benzoic acid | Biaryl Anthranilide Analogue, 2i
TypeSmall organic molecule
Emp. Form.C18H15N3O5
Mol. Mass.353.3288
SMILESOC(=O)c1ccccc1NC(=O)CCc1nc(no1)-c1ccc(O)cc1