Reaction Details
Target5-hydroxytryptamine receptor 2C
LigandBDBM50342548
Substrate/Competitorn/a
Meas. Tech.ChEMBL_744732 (CHEMBL1772753)
Ki 305±n/a nM
Citation Andrews, MDFish, PVBlagg, JBrabham, TKBrennan, PEBridgeland, ABrown, ADBungay, PJConlon, KMEdmunds, NJaf Forselles, KGibbons, CPGreen, MPHanton, GHolbrook, MJessiman, ASMcIntosh, KMcMurray, GNichols, CLRoot, JAStorer, RISutton, MRWard, RVWestbrook, DWhitlock, GA Pyrimido[4,5-d]azepines as potent and selective 5-HT2C receptor agonists: design, synthesis, and evaluation of PF-3246799 as a treatment for urinary incontinence. Bioorg Med Chem Lett21:2715-20 (2011) 
 
5-hydroxytryptamine receptor 2C
Name:5-hydroxytryptamine receptor 2C
Type:G Protein-Coupled Receptor (GPCR)
Mol. Mass.:51836.79
Organism:Homo sapiens (Human)
Description:P28335
Residue:458
BDBM50342548
NameBDBM50342548
Synonyms:2-(2-methylbenzyl)-6,7,8,9-tetrahydro-5H-pyrimido[5,4-d]azepine | CHEMBL1770378
TypeSmall organic molecule
Emp. Form.C16H19N3
Mol. Mass.253.3422
SMILESCc1ccccc1Cc1ncc2CCNCCc2n1