Reaction Details
TargetProtein-glutamine gamma-glutamyltransferase 2
LigandBDBM50342557
Substrate/Competitorn/a
Meas. Tech.ChEMBL_744966 (CHEMBL1771981)
Ki 3000±n/a nM
Citation Klöck, CJin, XChoi, KKhosla, CMadrid, PBSpencer, ARaimundo, BCBoardman, PLanza, GGriffin, JH Acylideneoxoindoles: a new class of reversible inhibitors of human transglutaminase 2. Bioorg Med Chem Lett21:2692-6 (2011) 
 
Protein-glutamine gamma-glutamyltransferase 2
Name:Protein-glutamine gamma-glutamyltransferase 2
Type:Protein
Mol. Mass.:77309.30
Organism:Homo sapiens (Human)
Description:P21980
Residue:687
BDBM50342557
NameBDBM50342557
Synonyms:5,5'-oxydiindoline-2,3-dione | CHEMBL1770389
TypeSmall organic molecule
Emp. Form.C16H8N2O5
Mol. Mass.308.2451
SMILESO=C1Nc2ccc(Oc3ccc4NC(=O)C(=O)c4c3)cc2C1=O