Reaction Details
TargetProtein-glutamine gamma-glutamyltransferase 2
LigandBDBM50342558
Substrate/Competitorn/a
Meas. Tech.ChEMBL_744966 (CHEMBL1771981)
Ki 15000±n/a nM
Citation Klöck, CJin, XChoi, KKhosla, CMadrid, PBSpencer, ARaimundo, BCBoardman, PLanza, GGriffin, JH Acylideneoxoindoles: a new class of reversible inhibitors of human transglutaminase 2. Bioorg Med Chem Lett21:2692-6 (2011) 
 
Protein-glutamine gamma-glutamyltransferase 2
Name:Protein-glutamine gamma-glutamyltransferase 2
Type:Protein
Mol. Mass.:77309.30
Organism:Homo sapiens (Human)
Description:P21980
Residue:687
BDBM50342558
NameBDBM50342558
Synonyms:5,5'-methylenediindoline-2,3-dione | CHEMBL1770390
TypeSmall organic molecule
Emp. Form.C17H10N2O4
Mol. Mass.306.2723
SMILESO=C1Nc2ccc(Cc3ccc4NC(=O)C(=O)c4c3)cc2C1=O