Reaction Details
TargetProtein-glutamine gamma-glutamyltransferase 2
LigandBDBM50342569
Substrate/Competitorn/a
Meas. Tech.ChEMBL_744966 (CHEMBL1771981)
Ki 12000±n/a nM
Citation Klöck, CJin, XChoi, KKhosla, CMadrid, PBSpencer, ARaimundo, BCBoardman, PLanza, GGriffin, JH Acylideneoxoindoles: a new class of reversible inhibitors of human transglutaminase 2. Bioorg Med Chem Lett21:2692-6 (2011) 
 
Protein-glutamine gamma-glutamyltransferase 2
Name:Protein-glutamine gamma-glutamyltransferase 2
Type:Protein
Mol. Mass.:77309.30
Organism:Homo sapiens (Human)
Description:P21980
Residue:687
BDBM50342569
NameBDBM50342569
Synonyms:(E)-3-(2-oxo-2-(pyridin-3-yl)ethylidene)indolin-2-one | CHEMBL1770538
TypeSmall organic molecule
Emp. Form.C15H10N2O2
Mol. Mass.250.2521
SMILESO=C(\C=C1\C(=O)Nc2ccccc12)c1cccnc1