Reaction Details
TargetProtein-glutamine gamma-glutamyltransferase 2
LigandBDBM50342571
Substrate/Competitorn/a
Meas. Tech.ChEMBL_744969 (CHEMBL1771984)
Ki 680±n/a nM
Citation Klöck, CJin, XChoi, KKhosla, CMadrid, PBSpencer, ARaimundo, BCBoardman, PLanza, GGriffin, JH Acylideneoxoindoles: a new class of reversible inhibitors of human transglutaminase 2. Bioorg Med Chem Lett21:2692-6 (2011) 
 
Protein-glutamine gamma-glutamyltransferase 2
Name:Protein-glutamine gamma-glutamyltransferase 2
Type:Protein
Mol. Mass.:77309.30
Organism:Homo sapiens (Human)
Description:P21980
Residue:687
BDBM50342571
NameBDBM50342571
Synonyms:(E)-5-bromo-3-(2-oxo-2-(pyridin-3-yl)ethylidene)indolin-2-one | CHEMBL1770541
TypeSmall organic molecule
Emp. Form.C15H9BrN2O2
Mol. Mass.329.148
SMILESBrc1ccc2NC(=O)\C(=C\C(=O)c3cccnc3)c2c1