Reaction Details
TargetCholinesterase
LigandBDBM10620
Substrate/Competitorn/a
Meas. Tech.ChEMBL_744972 (CHEMBL1771987)
IC50 49±n/a nM
Citation Al-Rashid, ZFHsung, RP (+)-Arisugacin A--computational evidence of a dual binding site covalent inhibitor of acetylcholinesterase. Bioorg Med Chem Lett21:2687-91 (2011) 
 
Cholinesterase
Name:Cholinesterase
Type:Homotetramer
Mol. Mass.:68422.27
Organism:Homo sapiens (Human)
Description:P06276
Residue:602
BDBM10620
NameBDBM10620
Synonyms:(S)-3-(1-(dimethylamino)ethyl)phenyl ethyl(methyl)carbamate 3-(1-(dimethylamino)ethyl)phenyl ethyl(methyl)carbamate CHEMBL636 Ethyl-methyl-carbamic acid 3-((R)-1-dimethylamino-ethyl)-phenyl ester Ethyl-methyl-carbamic acid 3-(1-dimethylamino-ethyl)-phenyl ester Rivastigmine SDZ-212-713 | SDZ-ENA-713
TypeSmall organic molecule
Emp. Form.C14H22N2O2
Mol. Mass.250.3367
SMILES[H][C@@](C)(N(C)C)c1cccc(OC(=O)N(C)CC)c1