Reaction Details
TargetAcetylcholinesterase
LigandBDBM50342607
Substrate/Competitorn/a
Meas. Tech.ChEMBL_744973 (CHEMBL1771988)
IC50 22000±n/a nM
Citation Bolognesi, MLBartolini, MTarozzi, AMorroni, FLizzi, FMilelli, AMinarini, ARosini, MHrelia, PAndrisano, VMelchiorre, C Multitargeted drugs discovery: balancing anti-amyloid and anticholinesterase capacity in a single chemical entity. Bioorg Med Chem Lett21:2655-8 (2011) 
 
Acetylcholinesterase
Name:Acetylcholinesterase
Type:Enzyme
Mol. Mass.:67792.70
Organism:Homo sapiens (Human)
Description:P22303
Residue:614
BDBM50342607
NameBDBM50342607
Synonyms:2,5-bis(6-(benzo[d]thiazol-2-ylmethylamino)hexylamino)cyclohexa-2,5-diene-1,4-dione | CHEMBL1770553
TypeSmall organic molecule
Emp. Form.C34H42N6O2S2
Mol. Mass.630.866
SMILESOc1cc(N=CCCCCCNCc2nc3ccccc3s2)c(O)cc1NCCCCCCNCc1nc2ccccc2s1