Reaction Details
TargetAcetylcholinesterase
LigandBDBM50342609
Substrate/Competitorn/a
Meas. Tech.ChEMBL_744973 (CHEMBL1771988)
IC50 305±n/a nM
Citation Bolognesi, MLBartolini, MTarozzi, AMorroni, FLizzi, FMilelli, AMinarini, ARosini, MHrelia, PAndrisano, VMelchiorre, C Multitargeted drugs discovery: balancing anti-amyloid and anticholinesterase capacity in a single chemical entity. Bioorg Med Chem Lett21:2655-8 (2011) 
 
Acetylcholinesterase
Name:Acetylcholinesterase
Type:Enzyme
Mol. Mass.:67792.70
Organism:Homo sapiens (Human)
Description:P22303
Residue:614
BDBM50342609
NameBDBM50342609
Synonyms:2,5-bis(6-(4-(benzo[d]thiazol-2-yl)benzylamino)hexylamino)cyclohexa-2,5-diene-1,4-dione | CHEMBL1770555
TypeSmall organic molecule
Emp. Form.C46H50N6O2S2
Mol. Mass.783.058
SMILESOc1cc(N=CCCCCCNCc2ccc(cc2)-c2nc3ccccc3s2)c(O)cc1NCCCCCCNCc1ccc(cc1)-c1nc2ccccc2s1