Reaction Details
TargetCholinesterase
LigandBDBM50342606
Substrate/Competitorn/a
Meas. Tech.ChEMBL_744974 (CHEMBL1771989)
IC50>10000±n/a nM
Citation Bolognesi, MLBartolini, MTarozzi, AMorroni, FLizzi, FMilelli, AMinarini, ARosini, MHrelia, PAndrisano, VMelchiorre, C Multitargeted drugs discovery: balancing anti-amyloid and anticholinesterase capacity in a single chemical entity. Bioorg Med Chem Lett21:2655-8 (2011) 
 
Cholinesterase
Name:Cholinesterase
Type:Homotetramer
Mol. Mass.:68422.27
Organism:Homo sapiens (Human)
Description:P06276
Residue:602
BDBM50342606
NameBDBM50342606
Synonyms:2,5-bis(3-(benzo[d]thiazol-2-ylmethylamino)propylamino)cyclohexa-2,5-diene-1,4-dione | CHEMBL1770552
TypeSmall organic molecule
Emp. Form.C28H30N6O2S2
Mol. Mass.546.707
SMILESOc1cc(N=CCCNCc2nc3ccccc3s2)c(O)cc1NCCCNCc1nc2ccccc2s1