Reaction Details
TargetCalcitonin gene-related peptide type 1 receptor
LigandBDBM50342636
Substrate/Competitorn/a
Meas. Tech.ChEMBL_745045 (CHEMBL1772121)
Ki 0.05±n/a nM
Citation Paone, DVNguyen, DNShaw, AWBurgey, CSPotteiger, CMDeng, JZMosser, SDSalvatore, CAYu, SRoller, SKane, SASelnick, HGVacca, JPWilliams, TM Orally bioavailable imidazoazepanes as calcitonin gene-related peptide (CGRP) receptor antagonists: discovery of MK-2918. Bioorg Med Chem Lett21:2683-6 (2011) 
 
Calcitonin gene-related peptide type 1 receptor
Name:Calcitonin gene-related peptide type 1 receptor
Type:Enzyme Catalytic Domain
Mol. Mass.:52980.45
Organism:Homo sapiens (Human)
Description:Q16602
Residue:461
BDBM50342636
NameBDBM50342636
Synonyms:CHEMBL1770726 | N-((6S,9R)-6-(2,3-difluorophenyl)-3-(2-ethoxypropan-2-yl)-6,7,8,9-tetrahydro-5H-imidazo[1,2-a]azepin-9-yl)-2'-oxo-1',2'-dihydrospiro[piperidine-4,4'-pyrido[2,3-d][1,3]oxazine]-1-carboxamide
TypeSmall organic molecule
Emp. Form.C31H36F2N6O4
Mol. Mass.594.6521
SMILESCCOC(C)(C)c1cnc2[C@@H](CC[C@H](Cn12)c1cccc(F)c1F)NC(=O)N1CCC2(CC1)OC(=O)Nc1ncccc21