Reaction Details
TargetCalcitonin gene-related peptide type 1 receptor
LigandBDBM50342621
Substrate/Competitorn/a
Meas. Tech.ChEMBL_745044 (CHEMBL1772120)
IC50 2.6±n/a nM
Citation Paone, DVNguyen, DNShaw, AWBurgey, CSPotteiger, CMDeng, JZMosser, SDSalvatore, CAYu, SRoller, SKane, SASelnick, HGVacca, JPWilliams, TM Orally bioavailable imidazoazepanes as calcitonin gene-related peptide (CGRP) receptor antagonists: discovery of MK-2918. Bioorg Med Chem Lett21:2683-6 (2011) 
 
Calcitonin gene-related peptide type 1 receptor
Name:Calcitonin gene-related peptide type 1 receptor
Type:Enzyme Catalytic Domain
Mol. Mass.:52980.45
Organism:Homo sapiens (Human)
Description:Q16602
Residue:461
BDBM50342621
NameBDBM50342621
Synonyms:CHEMBL1770566 | N-((6S,9R)-6-(2,3-difluorophenyl)-3-phenyl-6,7,8,9-tetrahydro-5H-imidazo[1,2-a]azepin-9-yl)-4-(2-oxo-2,3-dihydro-1H-imidazo[4,5-b]pyridin-1-yl)piperidine-1-carboxamide
TypeSmall organic molecule
Emp. Form.C32H31F2N7O2
Mol. Mass.583.631
SMILESFc1cccc([C@@H]2CC[C@@H](NC(=O)N3CCC(CC3)n3c4cccnc4[nH]c3=O)c3ncc(-c4ccccc4)n3C2)c1F