Reaction Details
TargetCalcitonin gene-related peptide type 1 receptor
LigandBDBM50342631
Substrate/Competitorn/a
Meas. Tech.ChEMBL_745043 (CHEMBL1772119)
IC50 2.7±n/a nM
Citation Paone, DVNguyen, DNShaw, AWBurgey, CSPotteiger, CMDeng, JZMosser, SDSalvatore, CAYu, SRoller, SKane, SASelnick, HGVacca, JPWilliams, TM Orally bioavailable imidazoazepanes as calcitonin gene-related peptide (CGRP) receptor antagonists: discovery of MK-2918. Bioorg Med Chem Lett21:2683-6 (2011) 
 
Calcitonin gene-related peptide type 1 receptor
Name:Calcitonin gene-related peptide type 1 receptor
Type:Enzyme Catalytic Domain
Mol. Mass.:52980.45
Organism:Homo sapiens (Human)
Description:Q16602
Residue:461
BDBM50342631
NameBDBM50342631
Synonyms:CHEMBL1770721 | N-((6S,9R)-6-(2,3-difluorophenyl)-3-(2,2,2-trifluoroethyl)-6,7,8,9-tetrahydro-5H-[1,2,4]triazolo[4,3-a]azepin-9-yl)-2'-oxo-1',2'-dihydrospiro[piperidine-4,3'-pyrrolo[2,3-b]pyridine]-1-carboxamide
TypeSmall organic molecule
Emp. Form.C27H26F5N7O2
Mol. Mass.575.5331
SMILESFc1cccc([C@@H]2CC[C@@H](NC(=O)N3CCC4(CC3)C(=O)Nc3ncccc43)c3nnc(CC(F)(F)F)n3C2)c1F