Reaction Details
TargetNeuropeptide Y receptor type 1
LigandBDBM50342731
Substrate/Competitorn/a
Meas. Tech.ChEMBL_744205 (CHEMBL1771962)
Ki 21±n/a nM
Citation Griffith, DAHargrove, DMMaurer, TSBlum, CADe Lombaert, SInthavongsay, JKKlade, LEMack, CMRose, CRSanders, MJCarpino, PA Discovery and evaluation of pyrazolo[1,5-a]pyrimidines as neuropeptide Y1 receptor antagonists. Bioorg Med Chem Lett21:2641-5 (2011) 
 
Neuropeptide Y receptor type 1
Name:Neuropeptide Y receptor type 1
Type:Enzyme Catalytic Domain
Mol. Mass.:44399.07
Organism:Homo sapiens (Human)
Description:NPY-Y1 NPY1R HUMAN::P25929
Residue:384
BDBM50342731
NameBDBM50342731
Synonyms:CHEMBL1771256 | N1-cyclopentyl-N2-(3-mesityl-2,5-dimethylpyrazolo[1,5-a]pyrimidin-7-yl)ethane-1,2-diamine
TypeSmall organic molecule
Emp. Form.C24H33N5
Mol. Mass.391.5523
SMILESCc1nn2c(NCCNC3CCCC3)cc(C)nc2c1-c1c(C)cc(C)cc1C