Reaction Details
TargetNeuropeptide Y receptor type 1
LigandBDBM50342728
Substrate/Competitorn/a
Meas. Tech.ChEMBL_744206 (CHEMBL1771963)
IC50 15±n/a nM
Citation Griffith, DAHargrove, DMMaurer, TSBlum, CADe Lombaert, SInthavongsay, JKKlade, LEMack, CMRose, CRSanders, MJCarpino, PA Discovery and evaluation of pyrazolo[1,5-a]pyrimidines as neuropeptide Y1 receptor antagonists. Bioorg Med Chem Lett21:2641-5 (2011) 
 
Neuropeptide Y receptor type 1
Name:Neuropeptide Y receptor type 1
Type:Enzyme Catalytic Domain
Mol. Mass.:44399.07
Organism:Homo sapiens (Human)
Description:NPY-Y1 NPY1R HUMAN::P25929
Residue:384
BDBM50342728
NameBDBM50342728
Synonyms:CHEMBL1771260 | N1-(3-(2,6-dichloro-4-ethoxyphenyl)-2,5-dimethylpyrazolo[1,5-a]pyrimidin-7-yl)-N2-(tetrahydro-2H-pyran-4-yl)ethane-1,2-diamine
TypeSmall organic molecule
Emp. Form.C23H29Cl2N5O2
Mol. Mass.478.415
SMILESCCOc1cc(Cl)c(-c2c(C)nn3c(NCCNC4CCOCC4)cc(C)nc23)c(Cl)c1